Problems launching error in Android Studio when packageDebug at Max OS X

Loading...

Problems launching error in Android Studio when packageDebug at Max OS X

[Fixed the problem]
I put an jar file at especially directory.
I removed it and I can launch app with Android Studio.
[Problem]
I use Mac OS X.
Before appearing Android Studio, I installed groovy, gradle with gvm.
And I used android gradle plugin.
I installed Android Studio from Android developers and try building app.
but,
…
:HelloAndroidStudio:packageDebug FAILED

FAILURE: Build failed with an exception.

What went wrong:
Execution failed for task ':HelloAndroidStudio:packageDebug'.

class org.bouncycastle.asn1.ASN1Primitive overrides final method equals.(Ljava/lang/Object;)Z

Try:
Run with --stacktrace option to get the stack trace. Run with --info or --debug option to get more log output.
My settings is wrong?
Additinal System variable (JAVA_HOME) settings is need?
Please help me.
I add Exception next.
Exception is:
org.gradle.api.tasks.TaskExecutionException: Execution failed for task ':HelloAndroidStudio:packageDebug'.
    at org.gradle.api.internal.tasks.execution.ExecuteActionsTaskExecuter.executeActions(ExecuteActionsTaskExecuter.java:69)
    at org.gradle.api.internal.tasks.execution.ExecuteActionsTaskExecuter.execute(ExecuteActionsTaskExecuter.java:46)
    at org.gradle.api.internal.tasks.execution.PostExecutionAnalysisTaskExecuter.execute(PostExecutionAnalysisTaskExecuter.java:35)
    at org.gradle.api.internal.changedetection.state.CacheLockReleasingTaskExecuter$1.run(CacheLockReleasingTaskExecuter.java:35)
    at org.gradle.internal.Factories$1.create(Factories.java:22)
    at org.gradle.cache.internal.DefaultCacheAccess.longRunningOperation(DefaultCacheAccess.java:179)
    at org.gradle.cache.internal.DefaultCacheAccess.longRunningOperation(DefaultCacheAccess.java:232)
    at org.gradle.cache.internal.DefaultPersistentDirectoryStore.longRunningOperation(DefaultPersistentDirectoryStore.java:142)
    at org.gradle.api.internal.changedetection.state.DefaultTaskArtifactStateCacheAccess.longRunningOperation(DefaultTaskArtifactStateCacheAccess.java:83)
    at org.gradle.api.internal.changedetection.state.CacheLockReleasingTaskExecuter.execute(CacheLockReleasingTaskExecuter.java:33)
    at org.gradle.api.internal.tasks.execution.SkipUpToDateTaskExecuter.execute(SkipUpToDateTaskExecuter.java:58)
    at org.gradle.api.internal.tasks.execution.ContextualisingTaskExecuter.execute(ContextualisingTaskExecuter.java:34)
    at org.gradle.api.internal.changedetection.state.CacheLockAcquiringTaskExecuter$1.run(CacheLockAcquiringTaskExecuter.java:39)
    at org.gradle.internal.Factories$1.create(Factories.java:22)
    at org.gradle.cache.internal.DefaultCacheAccess.useCache(DefaultCacheAccess.java:124)
    at org.gradle.cache.internal.DefaultCacheAccess.useCache(DefaultCacheAccess.java:112)
    at org.gradle.cache.internal.DefaultPersistentDirectoryStore.useCache(DefaultPersistentDirectoryStore.java:134)
    at org.gradle.api.internal.changedetection.state.DefaultTaskArtifactStateCacheAccess.useCache(DefaultTaskArtifactStateCacheAccess.java:79)
    at org.gradle.api.internal.changedetection.state.CacheLockAcquiringTaskExecuter.execute(CacheLockAcquiringTaskExecuter.java:37)
    at org.gradle.api.internal.tasks.execution.ValidatingTaskExecuter.execute(ValidatingTaskExecuter.java:57)
    at org.gradle.api.internal.tasks.execution.SkipEmptySourceFilesTaskExecuter.execute(SkipEmptySourceFilesTaskExecuter.java:41)
    at org.gradle.api.internal.tasks.execution.SkipTaskWithNoActionsExecuter.execute(SkipTaskWithNoActionsExecuter.java:51)
    at org.gradle.api.internal.tasks.execution.SkipOnlyIfTaskExecuter.execute(SkipOnlyIfTaskExecuter.java:52)
    at org.gradle.api.internal.tasks.execution.ExecuteAtMostOnceTaskExecuter.execute(ExecuteAtMostOnceTaskExecuter.java:42)
    at org.gradle.api.internal.AbstractTask.executeWithoutThrowingTaskFailure(AbstractTask.java:282)
    at org.gradle.execution.taskgraph.DefaultTaskPlanExecutor.executeTask(DefaultTaskPlanExecutor.java:48)
    at org.gradle.execution.taskgraph.DefaultTaskPlanExecutor.processTask(DefaultTaskPlanExecutor.java:34)
    at org.gradle.execution.taskgraph.DefaultTaskPlanExecutor.process(DefaultTaskPlanExecutor.java:27)
    at org.gradle.execution.taskgraph.DefaultTaskGraphExecuter.execute(DefaultTaskGraphExecuter.java:89)
    at org.gradle.execution.SelectedTaskExecutionAction.execute(SelectedTaskExecutionAction.java:29)
    at org.gradle.execution.DefaultBuildExecuter.execute(DefaultBuildExecuter.java:61)
    at org.gradle.execution.DefaultBuildExecuter.access$200(DefaultBuildExecuter.java:23)
    at org.gradle.execution.DefaultBuildExecuter$2.proceed(DefaultBuildExecuter.java:67)
    at org.gradle.api.internal.changedetection.state.TaskCacheLockHandlingBuildExecuter$1.run(TaskCacheLockHandlingBuildExecuter.java:31)
    at org.gradle.internal.Factories$1.create(Factories.java:22)
    at org.gradle.cache.internal.DefaultCacheAccess.useCache(DefaultCacheAccess.java:124)
    at org.gradle.cache.internal.DefaultCacheAccess.useCache(DefaultCacheAccess.java:112)
    at org.gradle.cache.internal.DefaultPersistentDirectoryStore.useCache(DefaultPersistentDirectoryStore.java:134)
    at org.gradle.api.internal.changedetection.state.DefaultTaskArtifactStateCacheAccess.useCache(DefaultTaskArtifactStateCacheAccess.java:79)
    at org.gradle.api.internal.changedetection.state.TaskCacheLockHandlingBuildExecuter.execute(TaskCacheLockHandlingBuildExecuter.java:29)
    at org.gradle.execution.DefaultBuildExecuter.execute(DefaultBuildExecuter.java:61)
    at org.gradle.execution.DefaultBuildExecuter.access$200(DefaultBuildExecuter.java:23)
    at org.gradle.execution.DefaultBuildExecuter$2.proceed(DefaultBuildExecuter.java:67)
    at org.gradle.execution.DryRunBuildExecutionAction.execute(DryRunBuildExecutionAction.java:32)
    at org.gradle.execution.DefaultBuildExecuter.execute(DefaultBuildExecuter.java:61)
    at org.gradle.execution.DefaultBuildExecuter.execute(DefaultBuildExecuter.java:54)
    at org.gradle.initialization.DefaultGradleLauncher.doBuildStages(DefaultGradleLauncher.java:166)
    at org.gradle.initialization.DefaultGradleLauncher.doBuild(DefaultGradleLauncher.java:113)
    at org.gradle.initialization.DefaultGradleLauncher.run(DefaultGradleLauncher.java:81)
    at org.gradle.launcher.exec.InProcessBuildActionExecuter$DefaultBuildController.run(InProcessBuildActionExecuter.java:64)
    at org.gradle.launcher.cli.ExecuteBuildAction.run(ExecuteBuildAction.java:33)
    at org.gradle.launcher.cli.ExecuteBuildAction.run(ExecuteBuildAction.java:24)
    at org.gradle.launcher.exec.InProcessBuildActionExecuter.execute(InProcessBuildActionExecuter.java:35)
    at org.gradle.launcher.exec.InProcessBuildActionExecuter.execute(InProcessBuildActionExecuter.java:26)
    at org.gradle.launcher.cli.RunBuildAction.run(RunBuildAction.java:50)
    at org.gradle.api.internal.Actions$RunnableActionAdapter.execute(Actions.java:171)
    at org.gradle.launcher.cli.CommandLineActionFactory$ParseAndBuildAction.execute(CommandLineActionFactory.java:201)
    at org.gradle.launcher.cli.CommandLineActionFactory$ParseAndBuildAction.execute(CommandLineActionFactory.java:174)
    at org.gradle.launcher.cli.CommandLineActionFactory$WithLogging.execute(CommandLineActionFactory.java:170)
    at org.gradle.launcher.cli.CommandLineActionFactory$WithLogging.execute(CommandLineActionFactory.java:139)
    at org.gradle.launcher.cli.ExceptionReportingAction.execute(ExceptionReportingAction.java:33)
    at org.gradle.launcher.cli.ExceptionReportingAction.execute(ExceptionReportingAction.java:22)
    at org.gradle.launcher.Main.doAction(Main.java:48)
    at org.gradle.launcher.bootstrap.EntryPoint.run(EntryPoint.java:45)
    at org.gradle.launcher.Main.main(Main.java:39)
    at org.gradle.launcher.bootstrap.ProcessBootstrap.runNoExit(ProcessBootstrap.java:50)
    at org.gradle.launcher.bootstrap.ProcessBootstrap.run(ProcessBootstrap.java:32)
    at org.gradle.launcher.GradleMain.main(GradleMain.java:26)
Caused by: java.lang.VerifyError: class org.bouncycastle.asn1.ASN1Primitive overrides final method equals.(Ljava/lang/Object;)Z
    at com.android.builder.internal.packaging.Packager.(Packager.java:253)
    at com.android.builder.AndroidBuilder.packageApk(AndroidBuilder.java:1022)
    at com.android.builder.AndroidBuilder$packageApk.call(Unknown Source)
    at com.android.build.gradle.tasks.PackageApplication.doFullTaskAction(PackageApplication.groovy:71)
    at com.android.build.gradle.internal.tasks.IncrementalTask.taskAction(IncrementalTask.groovy:71)
    at org.gradle.api.internal.BeanDynamicObject$MetaClassAdapter.invokeMethod(BeanDynamicObject.java:216)
    at org.gradle.api.internal.BeanDynamicObject.invokeMethod(BeanDynamicObject.java:122)
    at org.gradle.api.internal.CompositeDynamicObject.invokeMethod(CompositeDynamicObject.java:147)
    at com.android.build.gradle.tasks.PackageApplication_Decorated.invokeMethod(Unknown Source)
    at org.gradle.util.ReflectionUtil.invoke(ReflectionUtil.groovy:23)
    at org.gradle.api.internal.project.taskfactory.AnnotationProcessingTaskFactory$StandardTaskAction.doExecute(AnnotationProcessingTaskFactory.java:217)
    at org.gradle.api.internal.project.taskfactory.AnnotationProcessingTaskFactory$StandardTaskAction.execute(AnnotationProcessingTaskFactory.java:210)
    at org.gradle.api.internal.project.taskfactory.AnnotationProcessingTaskFactory$StandardTaskAction.execute(AnnotationProcessingTaskFactory.java:199)
    at org.gradle.api.internal.AbstractTask$TaskActionWrapper.execute(AbstractTask.java:526)
    at org.gradle.api.internal.AbstractTask$TaskActionWrapper.execute(AbstractTask.java:509)
    at org.gradle.api.internal.tasks.execution.ExecuteActionsTaskExecuter.executeAction(ExecuteActionsTaskExecuter.java:80)
    at org.gradle.api.internal.tasks.execution.ExecuteActionsTaskExecuter.executeActions(ExecuteActionsTaskExecuter.java:61)
    ... 67 more

Solutions/Answers:

Answer 1:

Probably you have files bcprov-jdk15on-1.48.jar (or similar) that conflicts with Android Studio.

I’ve removed these files from:
android-sdk-macosx/tools/lib/
/Library/Java/Extensions/

Also I’ve deleted .gradle folder from the home directory.

Answer 2:

Create an Environment variable in your Windows system named JAVA_HOME and set it to the location where you have Java SDK1.7

References

Loading...

IntelliJ – Debugging set next statement?

Loading...

IntelliJ – Debugging set next statement?

How can I step back to a previous line when I'm debugging in IntelliJ?  
I don't see anything in the debug menu or commands to do this.

Solutions/Answers:

Answer 1:

There’s no backward debugging support in IDEA currently. Nevertheless (for Java) there is Drop Frame action and button on the debugger toolbar. It lets you go one frame up in the stack and re-enter the current method.

enter image description here

Answer 2:

The Chronon plugin, which is available for free with IntelliJ IDEA 13, can do this for you. It has limitations, though; chiefly, if your application runs outside of the IDE itself (like a Tomcat or Jetty server), the free version won’t be usable with your setup.

References

Loading...